Opened 6 years ago

Closed 5 years ago

#2700 closed defect (invalid)

'grunt ci' fails, when install gets that far

Reported by: dustin Owned by:
Priority: major Milestone: 0.9.0
Version: 0.8.8 Keywords:
Cc:

Description

Sometimes I see this, either on my system or on Travis:

running develop
running bower_install
running npm_install
npm install
rm -rf bower_components
./node_modules/.bin/bower install
bower angular-bootstrap#~0.6.0  cached git://github.com/angular-ui/bootstrap-bower.git#0.6.0
bower angular-bootstrap#~0.6.0         validate 0.6.0 against git://github.com/angular-ui/bootstrap-bower.git#~0.6.0
bower angular-mocks#v1.2.5               cached git://github.com/angular/bower-angular-mocks.git#1.2.5
bower angular-mocks#v1.2.5             validate 1.2.5 against git://github.com/angular/bower-angular-mocks.git#v1.2.5
bower font-awesome#4.0.3                 cached git://github.com/FortAwesome/Font-Awesome.git#4.0.3
bower font-awesome#4.0.3               validate 4.0.3 against git://github.com/FortAwesome/Font-Awesome.git#4.0.3
bower moment#~2.1.0                      cached git://github.com/moment/moment.git#2.1.0
bower moment#~2.1.0                    validate 2.1.0 against git://github.com/moment/moment.git#~2.1.0
bower json2#*                            cached git://github.com/douglascrockford/JSON-js.git#3d7767b6b1
bower json2#*                          validate 3d7767b6b1 against git://github.com/douglascrockford/JSON-js.git#*
bower angular-animate#v1.2.5             cached git://github.com/angular/bower-angular-animate.git#1.2.5
bower angular-animate#v1.2.5           validate 1.2.5 against git://github.com/angular/bower-angular-animate.git#v1.2.5
bower angular#v1.2.5                     cached git://github.com/angular/bower-angular.git#1.2.5
bower angular#v1.2.5                   validate 1.2.5 against git://github.com/angular/bower-angular.git#v1.2.5
bower jquery#~2.0.0                      cached git://github.com/jquery/jquery.git#2.0.3
bower jquery#~2.0.0                    validate 2.0.3 against git://github.com/jquery/jquery.git#~2.0.0
bower html5shiv#~3.6.2                   cached git://github.com/aFarkas/html5shiv.git#3.6.2
bower html5shiv#~3.6.2                 validate 3.6.2 against git://github.com/aFarkas/html5shiv.git#~3.6.2
bower angular-ui-router#0.2.7            cached git://github.com/angular-ui/ui-router.git#0.2.7
bower angular-ui-router#0.2.7          validate 0.2.7 against git://github.com/angular-ui/ui-router.git#0.2.7
bower lodash#*                           cached git://github.com/lodash/lodash.git#2.4.1
bower lodash#*                         validate 2.4.1 against git://github.com/lodash/lodash.git#*
bower bootstrap#~3.0.0                   cached git://github.com/twbs/bootstrap.git#3.0.3
bower bootstrap#~3.0.0                 validate 3.0.3 against git://github.com/twbs/bootstrap.git#~3.0.0
bower requirejs#~2.1.5                   cached git://github.com/jrburke/requirejs-bower.git#2.1.11
bower requirejs#~2.1.5                 validate 2.1.11 against git://github.com/jrburke/requirejs-bower.git#~2.1.5
bower restangular#*                      cached git://github.com/mgonto/restangular.git#1.3.1
bower restangular#*                    validate 1.3.1 against git://github.com/mgonto/restangular.git#*
bower angular#>=1                        cached git://github.com/angular/bower-angular.git#1.2.13
bower angular#>=1                      validate 1.2.13 against git://github.com/angular/bower-angular.git#>=1
bower angular#>=1                           new version for git://github.com/angular/bower-angular.git#>=1
bower angular#>=1                       resolve git://github.com/angular/bower-angular.git#>=1
bower angular#1.2.5                      cached git://github.com/angular/bower-angular.git#1.2.5
bower angular#1.2.5                    validate 1.2.5 against git://github.com/angular/bower-angular.git#1.2.5
bower angular#>=1                      download https://github.com/angular/bower-angular/archive/v1.2.14-build.2273+sha.666137d.tar.gz
bower lodash#>=1.3.0 <2.5.0              cached git://github.com/lodash/lodash.git#2.4.1
bower lodash#>=1.3.0 <2.5.0            validate 2.4.1 against git://github.com/lodash/lodash.git#>=1.3.0 <2.5.0
bower angular#*                          cached git://github.com/angular/bower-angular.git#1.2.13
bower angular#*                        validate 1.2.13 against git://github.com/angular/bower-angular.git#*
bower angular#>= 1.1.5                   cached git://github.com/angular/bower-angular.git#1.2.13
bower angular#>= 1.1.5                 validate 1.2.13 against git://github.com/angular/bower-angular.git#>= 1.1.5
bower angular#>= 1.1.5                      new version for git://github.com/angular/bower-angular.git#>= 1.1.5
bower angular#>= 1.1.5                  resolve git://github.com/angular/bower-angular.git#>= 1.1.5
bower angular#>= 1.1.5                 download https://github.com/angular/bower-angular/archive/v1.2.14-build.2273+sha.666137d.tar.gz
bower jquery#>= 1.9.0                    cached git://github.com/jquery/jquery.git#2.1.0
bower jquery#>= 1.9.0                  validate 2.1.0 against git://github.com/jquery/jquery.git#>= 1.9.0
bower sizzle#1.10.16                     cached git://github.com/jquery/sizzle.git#1.10.16
bower sizzle#1.10.16                   validate 1.10.16 against git://github.com/jquery/sizzle.git#1.10.16
bower angular#>=1                       extract archive.tar.gz
bower angular#>= 1.1.5                  extract archive.tar.gz
bower angular#>= 1.1.5                 resolved git://github.com/angular/bower-angular.git#1.2.14-build.2273+sha.666137d
bower angular#>=1                        ENOENT ENOENT, lstat '/home/dustin/.cache/bower/packages/ef2188def21eb1bbd1f1792311942a53/1.2.14-build.2273%2Bsha.666137d/angular.js'

Stack trace:
/home/dustin/code/buildbot/t/buildbot/www/node_modules/bower/node_modules/fstream/lib/writer.js:284:26
Object.oncomplete (fs.js:107:15)

Console trace:
Trace
    at StandardRenderer.error (/home/dustin/code/buildbot/t/buildbot/www/node_modules/bower/lib/renderers/StandardRenderer.js:74:17)
    at Logger.updateNotifier.packageName (/home/dustin/code/buildbot/t/buildbot/www/node_modules/bower/bin/bower:109:18)
    at Logger.EventEmitter.emit (events.js:95:17)
    at Logger.emit (/home/dustin/code/buildbot/t/buildbot/www/node_modules/bower/node_modules/bower-logger/lib/Logger.js:29:39)
    at /home/dustin/code/buildbot/t/buildbot/www/node_modules/bower/lib/commands/install.js:27:16
    at _rejected (/home/dustin/code/buildbot/t/buildbot/www/node_modules/bower/node_modules/q/q.js:808:24)
    at /home/dustin/code/buildbot/t/buildbot/www/node_modules/bower/node_modules/q/q.js:834:30
    at Promise.when (/home/dustin/code/buildbot/t/buildbot/www/node_modules/bower/node_modules/q/q.js:1079:31)
    at Promise.promise.promiseDispatch (/home/dustin/code/buildbot/t/buildbot/www/node_modules/bower/node_modules/q/q.js:752:41)
    at /home/dustin/code/buildbot/t/buildbot/www/node_modules/bower/node_modules/q/q.js:574:44

System info:
Bower version: 1.2.8
Node version: 0.10.24
OS: Linux 3.10.25-gentoo-2014021101 x64
error: command './node_modules/.bin/bower' failed with exit status 1

But re-running without any changes may result in test failures:

PhantomJS 1.9.2 (Linux) buildbot service should query for changes at /changes and receive an empty array FAILED
        TypeError:
            at memoize (/home/dustin/code/buildbot/t/buildbot/www/buildbot_www/scripts/libs/lodash.js:5561)
            at /home/dustin/code/buildbot/t/buildbot/www/buildbot_www/scripts/services/buildbotService.js:27
            at /home/dustin/code/buildbot/t/buildbot/www/buildbot_www/scripts/services/buildbotService.js:36
            at /home/dustin/code/buildbot/t/buildbot/www/buildbot_www/scripts/services/buildbotService.js:206
            at /home/dustin/code/buildbot/t/buildbot/www/buildbot_www/scripts/libs/restangular.js:463
            at fetchFunction (/home/dustin/code/buildbot/t/buildbot/www/buildbot_www/scripts/libs/restangular.js:1040)
            at bound (/home/dustin/code/buildbot/t/buildbot/www/buildbot_www/scripts/libs/lodash.js:729)
            at /home/dustin/code/buildbot/t/buildbot/www/buildbot_www/scripts/services/buildbotService.js:117
            at /home/dustin/code/buildbot/t/buildbot/www/buildbot_www/scripts/libs/angular.js:10725
            at /home/dustin/code/buildbot/t/buildbot/www/buildbot_www/scripts/libs/angular.js:10811
            at /home/dustin/code/buildbot/t/buildbot/www/buildbot_www/scripts/libs/angular.js:11726
            at /home/dustin/code/buildbot/t/buildbot/www/buildbot_www/scripts/libs/angular.js:11554
            at /home/dustin/code/buildbot/t/buildbot/www/buildbot_www/scripts/test/libs/angular-mocks.js:1451
            at /home/dustin/code/buildbot/t/buildbot/www/buildbot_www/scripts/test/services/buildbotServiceSpec.js:27
PhantomJS 1.9.2 (Linux) buildbot service should query for builds/1/steps/2 and receive a SUCCESS result FAILED
        TypeError:
            at memoize (/home/dustin/code/buildbot/t/buildbot/www/buildbot_www/scripts/libs/lodash.js:5561)
            at /home/dustin/code/buildbot/t/buildbot/www/buildbot_www/scripts/services/buildbotService.js:27
            at /home/dustin/code/buildbot/t/buildbot/www/buildbot_www/scripts/services/buildbotService.js:36
            at /home/dustin/code/buildbot/t/buildbot/www/buildbot_www/scripts/services/buildbotService.js:206
            at /home/dustin/code/buildbot/t/buildbot/www/buildbot_www/scripts/libs/restangular.js:463
            at elemFunction (/home/dustin/code/buildbot/t/buildbot/www/buildbot_www/scripts/libs/restangular.js:1107)
            at bound (/home/dustin/code/buildbot/t/buildbot/www/buildbot_www/scripts/libs/lodash.js:729)
            at getFunction (/home/dustin/code/buildbot/t/buildbot/www/buildbot_www/scripts/libs/restangular.js:1161)
            at bound (/home/dustin/code/buildbot/t/buildbot/www/buildbot_www/scripts/libs/lodash.js:729)
            at /home/dustin/code/buildbot/t/buildbot/www/buildbot_www/scripts/services/buildbotService.js:126
            at /home/dustin/code/buildbot/t/buildbot/www/buildbot_www/scripts/services/buildbotService.js:168
            at /home/dustin/code/buildbot/t/buildbot/www/buildbot_www/scripts/services/buildbotService.js:188
            at /home/dustin/code/buildbot/t/buildbot/www/buildbot_www/scripts/test/services/buildbotServiceSpec.js:39
PhantomJS 1.9.2 (Linux) buildbot service should query for builds/1/steps/2 mocked via dataspec FAILED
        TypeError:
            at memoize (/home/dustin/code/buildbot/t/buildbot/www/buildbot_www/scripts/libs/lodash.js:5561)
            at /home/dustin/code/buildbot/t/buildbot/www/buildbot_www/scripts/services/buildbotService.js:27
            at /home/dustin/code/buildbot/t/buildbot/www/buildbot_www/scripts/services/buildbotService.js:36
            at /home/dustin/code/buildbot/t/buildbot/www/buildbot_www/scripts/services/buildbotService.js:206
            at /home/dustin/code/buildbot/t/buildbot/www/buildbot_www/scripts/libs/restangular.js:463
            at elemFunction (/home/dustin/code/buildbot/t/buildbot/www/buildbot_www/scripts/libs/restangular.js:1107)
            at bound (/home/dustin/code/buildbot/t/buildbot/www/buildbot_www/scripts/libs/lodash.js:729)
            at getFunction (/home/dustin/code/buildbot/t/buildbot/www/buildbot_www/scripts/libs/restangular.js:1161)
            at bound (/home/dustin/code/buildbot/t/buildbot/www/buildbot_www/scripts/libs/lodash.js:729)
            at /home/dustin/code/buildbot/t/buildbot/www/buildbot_www/scripts/services/buildbotService.js:126
            at /home/dustin/code/buildbot/t/buildbot/www/buildbot_www/scripts/services/buildbotService.js:168
            at /home/dustin/code/buildbot/t/buildbot/www/buildbot_www/scripts/services/buildbotService.js:188
            at /home/dustin/code/buildbot/t/buildbot/www/buildbot_www/scripts/test/services/buildbotServiceSpec.js:48
PhantomJS 1.9.2 (Linux) buildbot service should query default scope_key to route key FAILED
        TypeError:
            at memoize (/home/dustin/code/buildbot/t/buildbot/www/buildbot_www/scripts/libs/lodash.js:5561)
            at /home/dustin/code/buildbot/t/buildbot/www/buildbot_www/scripts/services/buildbotService.js:27
            at /home/dustin/code/buildbot/t/buildbot/www/buildbot_www/scripts/services/buildbotService.js:36
            at /home/dustin/code/buildbot/t/buildbot/www/buildbot_www/scripts/services/buildbotService.js:206
            at /home/dustin/code/buildbot/t/buildbot/www/buildbot_www/scripts/libs/restangular.js:463
            at elemFunction (/home/dustin/code/buildbot/t/buildbot/www/buildbot_www/scripts/libs/restangular.js:1107)
            at bound (/home/dustin/code/buildbot/t/buildbot/www/buildbot_www/scripts/libs/lodash.js:729)
            at getFunction (/home/dustin/code/buildbot/t/buildbot/www/buildbot_www/scripts/libs/restangular.js:1161)
            at bound (/home/dustin/code/buildbot/t/buildbot/www/buildbot_www/scripts/libs/lodash.js:729)
            at /home/dustin/code/buildbot/t/buildbot/www/buildbot_www/scripts/services/buildbotService.js:126
            at /home/dustin/code/buildbot/t/buildbot/www/buildbot_www/scripts/services/buildbotService.js:168
            at /home/dustin/code/buildbot/t/buildbot/www/buildbot_www/scripts/services/buildbotService.js:188
            at /home/dustin/code/buildbot/t/buildbot/www/buildbot_www/scripts/test/services/buildbotServiceSpec.js:60
PhantomJS 1.9.2 (Linux) buildbot service should update the $scope when event received FAILED
        TypeError:
            at memoize (/home/dustin/code/buildbot/t/buildbot/www/buildbot_www/scripts/libs/lodash.js:5561)
            at /home/dustin/code/buildbot/t/buildbot/www/buildbot_www/scripts/services/buildbotService.js:27
            at /home/dustin/code/buildbot/t/buildbot/www/buildbot_www/scripts/services/buildbotService.js:36
            at /home/dustin/code/buildbot/t/buildbot/www/buildbot_www/scripts/services/buildbotService.js:206
            at /home/dustin/code/buildbot/t/buildbot/www/buildbot_www/scripts/libs/restangular.js:463
            at elemFunction (/home/dustin/code/buildbot/t/buildbot/www/buildbot_www/scripts/libs/restangular.js:1107)
            at bound (/home/dustin/code/buildbot/t/buildbot/www/buildbot_www/scripts/libs/lodash.js:729)
            at getFunction (/home/dustin/code/buildbot/t/buildbot/www/buildbot_www/scripts/libs/restangular.js:1161)
            at bound (/home/dustin/code/buildbot/t/buildbot/www/buildbot_www/scripts/libs/lodash.js:729)
            at /home/dustin/code/buildbot/t/buildbot/www/buildbot_www/scripts/services/buildbotService.js:126
            at /home/dustin/code/buildbot/t/buildbot/www/buildbot_www/scripts/services/buildbotService.js:168
            at /home/dustin/code/buildbot/t/buildbot/www/buildbot_www/scripts/services/buildbotService.js:188
            at /home/dustin/code/buildbot/t/buildbot/www/buildbot_www/scripts/test/services/buildbotServiceSpec.js:78
PhantomJS 1.9.2 (Linux) buildbot service should update the $scope when event received for collections FAILED
        TypeError:
            at memoize (/home/dustin/code/buildbot/t/buildbot/www/buildbot_www/scripts/libs/lodash.js:5561)
            at /home/dustin/code/buildbot/t/buildbot/www/buildbot_www/scripts/services/buildbotService.js:27
            at /home/dustin/code/buildbot/t/buildbot/www/buildbot_www/scripts/services/buildbotService.js:36
            at /home/dustin/code/buildbot/t/buildbot/www/buildbot_www/scripts/services/buildbotService.js:206
            at /home/dustin/code/buildbot/t/buildbot/www/buildbot_www/scripts/libs/restangular.js:463
            at fetchFunction (/home/dustin/code/buildbot/t/buildbot/www/buildbot_www/scripts/libs/restangular.js:1040)
            at bound (/home/dustin/code/buildbot/t/buildbot/www/buildbot_www/scripts/libs/lodash.js:729)
            at /home/dustin/code/buildbot/t/buildbot/www/buildbot_www/scripts/services/buildbotService.js:117
            at /home/dustin/code/buildbot/t/buildbot/www/buildbot_www/scripts/libs/angular.js:10725
            at /home/dustin/code/buildbot/t/buildbot/www/buildbot_www/scripts/libs/angular.js:10811
            at /home/dustin/code/buildbot/t/buildbot/www/buildbot_www/scripts/libs/angular.js:11726
            at /home/dustin/code/buildbot/t/buildbot/www/buildbot_www/scripts/libs/angular.js:11554
            at /home/dustin/code/buildbot/t/buildbot/www/buildbot_www/scripts/test/libs/angular-mocks.js:1451
            at /home/dustin/code/buildbot/t/buildbot/www/buildbot_www/scripts/test/services/buildbotServiceSpec.js:110
PhantomJS 1.9.2 (Linux) buildbot service should update the $scope when event received for collections with same id FAILED
        TypeError:
            at memoize (/home/dustin/code/buildbot/t/buildbot/www/buildbot_www/scripts/libs/lodash.js:5561)
            at /home/dustin/code/buildbot/t/buildbot/www/buildbot_www/scripts/services/buildbotService.js:27
            at /home/dustin/code/buildbot/t/buildbot/www/buildbot_www/scripts/services/buildbotService.js:36
            at /home/dustin/code/buildbot/t/buildbot/www/buildbot_www/scripts/services/buildbotService.js:206
            at /home/dustin/code/buildbot/t/buildbot/www/buildbot_www/scripts/libs/restangular.js:463
            at fetchFunction (/home/dustin/code/buildbot/t/buildbot/www/buildbot_www/scripts/libs/restangular.js:1040)
            at bound (/home/dustin/code/buildbot/t/buildbot/www/buildbot_www/scripts/libs/lodash.js:729)
            at /home/dustin/code/buildbot/t/buildbot/www/buildbot_www/scripts/services/buildbotService.js:117
            at /home/dustin/code/buildbot/t/buildbot/www/buildbot_www/scripts/libs/angular.js:10725
            at /home/dustin/code/buildbot/t/buildbot/www/buildbot_www/scripts/libs/angular.js:10811
            at /home/dustin/code/buildbot/t/buildbot/www/buildbot_www/scripts/libs/angular.js:11726
            at /home/dustin/code/buildbot/t/buildbot/www/buildbot_www/scripts/libs/angular.js:11554
            at /home/dustin/code/buildbot/t/buildbot/www/buildbot_www/scripts/test/libs/angular-mocks.js:1451
            at /home/dustin/code/buildbot/t/buildbot/www/buildbot_www/scripts/test/services/buildbotServiceSpec.js:139
PhantomJS 1.9.2 (Linux) buildbot service has a onchild api which should be usable for restangular api FAILED
        TypeError:
            at memoize (/home/dustin/code/buildbot/t/buildbot/www/buildbot_www/scripts/libs/lodash.js:5561)
            at /home/dustin/code/buildbot/t/buildbot/www/buildbot_www/scripts/services/buildbotService.js:27
            at /home/dustin/code/buildbot/t/buildbot/www/buildbot_www/scripts/services/buildbotService.js:36
            at /home/dustin/code/buildbot/t/buildbot/www/buildbot_www/scripts/services/buildbotService.js:206
            at /home/dustin/code/buildbot/t/buildbot/www/buildbot_www/scripts/libs/restangular.js:463
            at fetchFunction (/home/dustin/code/buildbot/t/buildbot/www/buildbot_www/scripts/libs/restangular.js:1040)
            at bound (/home/dustin/code/buildbot/t/buildbot/www/buildbot_www/scripts/libs/lodash.js:729)
            at /home/dustin/code/buildbot/t/buildbot/www/buildbot_www/scripts/services/buildbotService.js:117
            at /home/dustin/code/buildbot/t/buildbot/www/buildbot_www/scripts/libs/angular.js:10725
            at /home/dustin/code/buildbot/t/buildbot/www/buildbot_www/scripts/libs/angular.js:10811
            at /home/dustin/code/buildbot/t/buildbot/www/buildbot_www/scripts/libs/angular.js:11726
            at /home/dustin/code/buildbot/t/buildbot/www/buildbot_www/scripts/libs/angular.js:11554
            at /home/dustin/code/buildbot/t/buildbot/www/buildbot_www/scripts/test/libs/angular-mocks.js:1451
            at /home/dustin/code/buildbot/t/buildbot/www/buildbot_www/scripts/test/services/buildbotServiceSpec.js:177
PhantomJS 1.9.2 (Linux) buildbot service has a bindHierarchy helper to bind a hierarchy FAILED
        TypeError:
            at memoize (/home/dustin/code/buildbot/t/buildbot/www/buildbot_www/scripts/libs/lodash.js:5561)
            at /home/dustin/code/buildbot/t/buildbot/www/buildbot_www/scripts/services/buildbotService.js:27
            at /home/dustin/code/buildbot/t/buildbot/www/buildbot_www/scripts/services/buildbotService.js:36
            at /home/dustin/code/buildbot/t/buildbot/www/buildbot_www/scripts/services/buildbotService.js:206
            at /home/dustin/code/buildbot/t/buildbot/www/buildbot_www/scripts/libs/restangular.js:463
            at elemFunction (/home/dustin/code/buildbot/t/buildbot/www/buildbot_www/scripts/libs/restangular.js:1107)
            at bound (/home/dustin/code/buildbot/t/buildbot/www/buildbot_www/scripts/libs/lodash.js:729)
            at getFunction (/home/dustin/code/buildbot/t/buildbot/www/buildbot_www/scripts/libs/restangular.js:1161)
            at bound (/home/dustin/code/buildbot/t/buildbot/www/buildbot_www/scripts/libs/lodash.js:729)
            at /home/dustin/code/buildbot/t/buildbot/www/buildbot_www/scripts/services/buildbotService.js:126
            at /home/dustin/code/buildbot/t/buildbot/www/buildbot_www/scripts/services/buildbotService.js:168
            at /home/dustin/code/buildbot/t/buildbot/www/buildbot_www/scripts/services/buildbotService.js:188
            at /home/dustin/code/buildbot/t/buildbot/www/buildbot_www/scripts/services/buildbotService.js:223
            at /home/dustin/code/buildbot/t/buildbot/www/buildbot_www/scripts/test/services/buildbotServiceSpec.js:194
PhantomJS 1.9.2 (Linux) buildbot service should use one request for one endpoint, take advantage of                events to maintain synchronisation FAILED
        TypeError:
            at memoize (/home/dustin/code/buildbot/t/buildbot/www/buildbot_www/scripts/libs/lodash.js:5561)
            at /home/dustin/code/buildbot/t/buildbot/www/buildbot_www/scripts/services/buildbotService.js:27
            at /home/dustin/code/buildbot/t/buildbot/www/buildbot_www/scripts/services/buildbotService.js:36
            at /home/dustin/code/buildbot/t/buildbot/www/buildbot_www/scripts/services/buildbotService.js:206
            at /home/dustin/code/buildbot/t/buildbot/www/buildbot_www/scripts/libs/restangular.js:463
            at fetchFunction (/home/dustin/code/buildbot/t/buildbot/www/buildbot_www/scripts/libs/restangular.js:1040)
            at bound (/home/dustin/code/buildbot/t/buildbot/www/buildbot_www/scripts/libs/lodash.js:729)
            at /home/dustin/code/buildbot/t/buildbot/www/buildbot_www/scripts/services/buildbotService.js:117
            at /home/dustin/code/buildbot/t/buildbot/www/buildbot_www/scripts/libs/angular.js:10725
            at /home/dustin/code/buildbot/t/buildbot/www/buildbot_www/scripts/libs/angular.js:10811
            at /home/dustin/code/buildbot/t/buildbot/www/buildbot_www/scripts/libs/angular.js:11726
            at /home/dustin/code/buildbot/t/buildbot/www/buildbot_www/scripts/libs/angular.js:11554
            at /home/dustin/code/buildbot/t/buildbot/www/buildbot_www/scripts/test/libs/angular-mocks.js:1451
            at /home/dustin/code/buildbot/t/buildbot/www/buildbot_www/scripts/test/services/buildbotServiceSpec.js:249
PhantomJS 1.9.2 (Linux) buildbot service should reload the data in case of loss of synchronisation FAILED
        TypeError:
            at memoize (/home/dustin/code/buildbot/t/buildbot/www/buildbot_www/scripts/libs/lodash.js:5561)
            at /home/dustin/code/buildbot/t/buildbot/www/buildbot_www/scripts/services/buildbotService.js:27
            at /home/dustin/code/buildbot/t/buildbot/www/buildbot_www/scripts/services/buildbotService.js:36
            at /home/dustin/code/buildbot/t/buildbot/www/buildbot_www/scripts/services/buildbotService.js:206
            at /home/dustin/code/buildbot/t/buildbot/www/buildbot_www/scripts/libs/restangular.js:463
            at fetchFunction (/home/dustin/code/buildbot/t/buildbot/www/buildbot_www/scripts/libs/restangular.js:1040)
            at bound (/home/dustin/code/buildbot/t/buildbot/www/buildbot_www/scripts/libs/lodash.js:729)
            at /home/dustin/code/buildbot/t/buildbot/www/buildbot_www/scripts/services/buildbotService.js:117
            at /home/dustin/code/buildbot/t/buildbot/www/buildbot_www/scripts/libs/angular.js:10725
            at /home/dustin/code/buildbot/t/buildbot/www/buildbot_www/scripts/libs/angular.js:10811
            at /home/dustin/code/buildbot/t/buildbot/www/buildbot_www/scripts/libs/angular.js:11726
            at /home/dustin/code/buildbot/t/buildbot/www/buildbot_www/scripts/libs/angular.js:11554
            at /home/dustin/code/buildbot/t/buildbot/www/buildbot_www/scripts/test/libs/angular-mocks.js:1451
            at /home/dustin/code/buildbot/t/buildbot/www/buildbot_www/scripts/test/services/buildbotServiceSpec.js:293
PhantomJS 1.9.2 (Linux): Executed 22 of 22 (11 FAILED) (0.168 secs / 0.129 secs)
Warning: Task "karma:ci" failed. Use --force to continue.

Aborted due to warnings.

I haven't been able to bisect these warnings, as every version I've tried (after re-running bower until it succeeds) either fails with these errors or fails with

Warning: Unable to read "src/scripts/libs/angular-ui-router.js" file (Error code: ENOENT). Use --force to continue.

which I believe is a result of a newer version of Angular being available now than when that commit was made.

Change History (1)

comment:1 Changed 5 years ago by dustin

  • Resolution set to invalid
  • Status changed from new to closed

We're using gulp now.

Note: See TracTickets for help on using tickets.